Autor Tema: Problema al compilar wlandecrypter  (Leído 2012 veces)

0 Usuarios y 1 Visitante están viendo este tema.

Muzzly

  • Visitante
Problema al compilar wlandecrypter
« en: 22-09-2008, 11:15 (Lunes) »
Pues me he bajado el archivo, lo he descomprimido y cuando hago un make me sale esto.

gcc -g -O2 -D_FILE_OFFSET_BITS=64 wlandecrypter.c -o wlandecrypter
wlandecrypter.c:19:19: error: stdio.h: No existe el fichero ó directorio
wlandecrypter.c:20:20: error: stdlib.h: No existe el fichero ó directorio
wlandecrypter.c:21:20: error: string.h: No existe el fichero ó directorio
wlandecrypter.c:53: error: expected ‘)’ before ‘*’ token
wlandecrypter.c: En la función ‘main’:
wlandecrypter.c:64: error: ‘FILE’ no se declaró aquí (primer uso en esta función)
wlandecrypter.c:64: error: (Cada identificador no declarado solamente se reporta una vez
wlandecrypter.c:64: error: para cada funcion en la que aparece.)
wlandecrypter.c:64: error: ‘fichero’ no se declaró aquí (primer uso en esta función)
wlandecrypter.c:72: aviso: declaración implícita incompatible de la función interna ‘fprintf’
wlandecrypter.c:72: error: ‘stderr’ no se declaró aquí (primer uso en esta función)
wlandecrypter.c:75: aviso: declaración implícita incompatible de la función interna ‘strlen’
wlandecrypter.c:141: error: ‘NULL’ no se declaró aquí (primer uso en esta función)
wlandecrypter.c:156: error: ‘stdout’ no se declaró aquí (primer uso en esta función)
wlandecrypter.c: En la función ‘initRouters’:
wlandecrypter.c:174: aviso: declaración implícita incompatible de la función interna ‘strcpy’
wlandecrypter.c: En la función ‘datosRouters’:
wlandecrypter.c:188: aviso: declaración implícita incompatible de la función interna ‘strcpy’
wlandecrypter.c: En la función ‘muestraAyuda’:
wlandecrypter.c:225: aviso: declaración implícita incompatible de la función interna ‘fprintf’
wlandecrypter.c:225: error: ‘stderr’ no se declaró aquí (primer uso en esta función)
wlandecrypter.c: En la función ‘buscaBssid’:
wlandecrypter.c:239: aviso: declaración implícita incompatible de la función interna ‘strlen’
wlandecrypter.c: En el nivel principal:
wlandecrypter.c:254: error: expected ‘)’ before ‘*’ token
make: *** [wlandecrypter] Error 1


¿Que hago mal?