Autor Tema: Error al compilar aircrack-ng-1.0-rc1 ¿Alguna solucion?  (Leído 2732 veces)

0 Usuarios y 1 Visitante están viendo este tema.

sune

  • Visitante
Error al compilar aircrack-ng-1.0-rc1 ¿Alguna solucion?
« en: 02-01-2009, 09:35 (Viernes) »
Hola a todos

Pues lo dicho esto es lo que me sale al compilar:

Código: [Seleccionar]
make SQLITE=true airpcap=true
make -C src all
make[1]: se ingresa al directorio `/home/sune/aircrack-ng-1.0-rc1/src'
make -C osdep
make[2]: se ingresa al directorio `/home/sune/aircrack-ng-1.0-rc1/src/osdep'
Building for Linux
make[3]: se ingresa al directorio `/home/sune/aircrack-ng-1.0-rc1/src/osdep'
make[3]: `.os.Linux' está actualizado.
make[3]: se sale del directorio `/home/sune/aircrack-ng-1.0-rc1/src/osdep'
make[2]: se sale del directorio `/home/sune/aircrack-ng-1.0-rc1/src/osdep'
gcc -g -W -Wall -Werror -O3 -D_FILE_OFFSET_BITS=64 -D_REVISION=0  -I/usr/local/include -DHAVE_SQLITE -Iinclude   -c -o aircrack-ng.o aircrack-ng.c
En el fichero incluído de aircrack-ng.c:63:
crypto.h:12:26: error: openssl/hmac.h: No existe el fichero o el directorio
crypto.h:13:25: error: openssl/sha.h: No existe el fichero o el directorio
crypto.h:15:25: error: openssl/rc4.h: No existe el fichero o el directorio
crypto.h:16:25: error: openssl/aes.h: No existe el fichero o el directorio
aircrack-ng.c:69:21: error: sqlite3.h: No existe el fichero o el directorio
aircrack-ng.c:70: error: expected ‘=’, ‘,’, ‘;’, ‘asm’ or ‘__attribute__’ before ‘*’ token
cc1: warnings being treated as errors
aircrack-ng.c: En la función ‘do_wpa_crack’:
aircrack-ng.c:4026: error: declaración implícita de la función ‘HMAC’
aircrack-ng.c:4026: error: declaración implícita de la función ‘EVP_sha1’
aircrack-ng.c:4032: error: declaración implícita de la función ‘EVP_md5’
aircrack-ng.c: En la función ‘main’:
aircrack-ng.c:4770: error: declaración implícita de la función ‘sqlite3_open’
aircrack-ng.c:4770: error: ‘db’ no se declaró aquí (primer uso en esta función)
aircrack-ng.c:4770: error: (Cada identificador no declarado solamente se reporta una vez
aircrack-ng.c:4770: error: para cada funcion en la que aparece.)
aircrack-ng.c:4771: error: declaración implícita de la función ‘sqlite3_errmsg’
aircrack-ng.c:4771: error: el formato ‘%s’ espera el tipo ‘char *’, pero el argumento 3 es de tipo ‘int’
aircrack-ng.c:4772: error: declaración implícita de la función ‘sqlite3_close’
aircrack-ng.c:5363: error: declaración implícita de la función ‘sqlite3_mprintf’
aircrack-ng.c:5363: error: la asignación crea un puntero desde un entero sin una conversión
aircrack-ng.c:5365: error: declaración implícita de la función ‘sqlite3_exec’
aircrack-ng.c:5366: error: ‘SQLITE_LOCKED’ no se declaró aquí (primer uso en esta función)
aircrack-ng.c:5366: error: ‘SQLITE_BUSY’ no se declaró aquí (primer uso en esta función)
aircrack-ng.c:5372: error: ‘SQLITE_OK’ no se declaró aquí (primer uso en esta función)
aircrack-ng.c:5372: error: ‘SQLITE_ABORT’ no se declaró aquí (primer uso en esta función)
aircrack-ng.c:5374: error: declaración implícita de la función ‘sqlite3_free’
make[1]: *** [aircrack-ng.o] Error 1
make[1]: se sale del directorio `/home/sune/aircrack-ng-1.0-rc1/src'
make: *** [all] Error 2

Tengo instalado para las dependencias:

-SQLite
-autoconf
-libtool

¿Alguien sabe el por que de los errorres?

Gracias de antemano  ;)



sirvico

  • Visitante
Re: Error al compilar aircrack-ng-1.0-rc1 ¿Alguna solucion?
« Respuesta #1 en: 16-01-2009, 20:16 (Viernes) »
prueba instalando openssl-devel
« Última modificación: 16-01-2009, 20:19 (Viernes) por sirvico »